Target
Cytochrome P450 2D6
Ligand
BDBM50325471
Substrate
Meas. Tech.
ChEMBL_652209 (CHEMBL1228482)
IC50
>20000±n/a nM
Citation
 Ting, PCLee, JFAlbanese, MMWu, JAslanian, RFavreau, LNardo, CKorfmacher, WAWest, REWilliams, SMAnthes, JCRivelli, MACorboz, MRHey, JA The synthesis and structure-activity relationship of 4-benzimidazolyl-piperidinylcarbonyl-piperidine analogs as histamine H3 antagonists. Bioorg Med Chem Lett 20:5004-8 (2010)  
Target
Name:
Cytochrome P450 2D6
Synonyms:
CP2D6_HUMAN CYP2DL1 Cytochrome P450 2D6 (CYP2D6) P450-DB1
Type:
Protein
Mol. Mass.:
55774.82
Organism:
Homo sapiens (Human)
Description:
P10635
Residue:
497
  
Inhibitor
Name:
BDBM50325471
Synonyms:
1-(2-methoxyethyl)-3-(1-(1-(pyridin-4-ylmethyl)piperidine-4-carbonyl)piperidin-4-yl)-1H-benzo[d]imidazol-2(3H)-one | CHEMBL1222717
Type:
Small organic molecule
Emp. Form.:
C27H35N5O3
Mol. Mass.:
477.5985
SMILES:
COCCn1c2ccccc2n(C2CCN(CC2)C(=O)C2CCN(Cc3ccncc3)CC2)c1=O
: