Target
Extracellular calcium-sensing receptor
Ligand
BDBM50325524
Substrate
Meas. Tech.
ChEMBL_652215 (CHEMBL1228488)
IC50
2.6±n/a nM
Citation
 Gerspacher, MAltmann, EBeerli, RBuhl, TEndres, RGamse, RKameni-Tcheudji, JKneissel, MKrawinkler, KHMissbach, MSchmidt, ASeuwen, KWeiler, SWidler, L Penta-substituted benzimidazoles as potent antagonists of the calcium-sensing receptor (CaSR-antagonists). Bioorg Med Chem Lett 20:5161-4 (2010)  
Target
Name:
Extracellular calcium-sensing receptor
Synonyms:
CASR CaR Calcium-sensing receptor (CaSR) GPRC2A Parathyroid Cell calcium-sensing receptor Synonyms=GPRC2A | hCasR
Type:
Protein
Mol. Mass.:
120663.13
Organism:
Homo sapiens (Human)
Description:
P41180
Residue:
1078
  
Inhibitor
Name:
BDBM50325524
Synonyms:
2-(4-isopropylphenyl)-7-methoxy-1-(2-methoxyethyl)-5-((2-(methylsulfinyl)pyridin-3-yl)methyl)-4-(trifluoromethyl)-1H-benzo[d]imidazole | CHEMBL1223771
Type:
Small organic molecule
Emp. Form.:
C28H30F3N3O3S
Mol. Mass.:
545.616
SMILES:
COCCn1c(nc2c(c(Cc3cccnc3S(C)=O)cc(OC)c12)C(F)(F)F)-c1ccc(cc1)C(C)C
: