Target
Cannabinoid receptor 2
Ligand
BDBM50325584
Substrate
Meas. Tech.
ChEMBL_652252 (CHEMBL1225455)
Ki
5.30±n/a nM
Citation
 Lange, JHAttali, Avan der Neut, MAWals, HCMulder, AZilaout, HDuursma, Avan Aken, HHvan Vliet, BJ Two distinct classes of novel pyrazolinecarboxamides as potent cannabinoid CB1 receptor agonists. Bioorg Med Chem Lett 20:4992-8 (2010)  
Target
Name:
Cannabinoid receptor 2
Synonyms:
CANNABINOID CB2 CB2 CB2B CNR2_HUMAN Cannabinoid CB2 receptor Cannabinoid receptor 2 (CB2R) | hCB2
Type:
G Protein-Coupled Receptor (GPCR)
Mol. Mass.:
39690.94
Organism:
Homo sapiens (Human)
Description:
P34972
Residue:
360
  
Inhibitor
Name:
BDBM50325584
Synonyms:
(+)-3-pentyl-4-phenyl-N-((1R,2S,4S)-1,7,7-trimethylbicyclo[2.2.1]heptan-2-yl)-4,5-dihydro-1H-pyrazole-1-carboxamide 3-pentyl-4-phenyl-N-((1R,2S,4R)-1,7,7-trimethylbicyclo[2.2.1]heptan-2-yl)-4,5-dihydro-1H-pyrazole-1-carboxamide | CHEMBL1223588
Type:
Small organic molecule
Emp. Form.:
C25H37N3O
Mol. Mass.:
395.5808
SMILES:
CCCCCC1=NN(CC1c1ccccc1)C(=O)N[C@H]1C[C@H]2CC[C@]1(C)C2(C)C
: