Target
Neuropeptide Y receptor type 1
Ligand
BDBM50325605
Substrate
Meas. Tech.
ChEMBL_652269 (CHEMBL1225472)
Ki
0.9±n/a nM
Citation
 Weiss, SKeller, MBernhardt, GBuschauer, AKönig, B N(G)-Acyl-argininamides as NPY Y(1) receptor antagonists: Influence of structurally diverse acyl substituents on stability and affinity. Bioorg Med Chem 18:6292-304 (2010)  
Target
Name:
Neuropeptide Y receptor type 1
Synonyms:
NPY-Y1 NPY1R NPYR neuropeptide Y receptor Y1
Type:
Enzyme Catalytic Domain
Mol. Mass.:
44399.07
Organism:
Homo sapiens (Human)
Description:
NPY-Y1 NPY1R HUMAN::P25929
Residue:
384
  
Inhibitor
Name:
BDBM50325605
Synonyms:
(R)-methyl 8-(3-(4-(2,2-diphenylacetamido)-5-(4-hydroxybenzylamino)-5-oxopentyl)guanidino)-8-oxooctanoate | CHEMBL1223992
Type:
Small organic molecule
Emp. Form.:
C36H45N5O6
Mol. Mass.:
643.7724
SMILES:
COC(=O)CCCCCCC(=O)NC(N)=NCCC[C@@H](NC(=O)C(c1ccccc1)c1ccccc1)C(=O)NCc1ccc(O)cc1
: