Target
5-hydroxytryptamine receptor 2A
Ligand
BDBM50325665
Substrate
Meas. Tech.
ChEMBL_652346 (CHEMBL1225549)
Ki
>10000±n/a nM
Citation
 Kwon, YJSaubern, SMacdonald, JMHuang, XPSetola, VRoth, BL N-tetrahydrothiochromenoisoxazole-1-carboxamides as selective antagonists of cloned human 5-HT2B. Bioorg Med Chem Lett 20:5488-90 (2010)  
Target
Name:
5-hydroxytryptamine receptor 2A
Synonyms:
5-HT-2 5-HT2A 5-hydroxytryptamine receptor 2A (5HT-2A) 5HT2A_HUMAN HTR2A | Serotonin receptor 2A
Type:
undefined
Mol. Mass.:
52607.65
Organism:
Homo sapiens (Human)
Description:
P28223
Residue:
471
  
Inhibitor
Name:
BDBM50325665
Synonyms:
CHEMBL1224101 | N-isopropyl-3,3a,4,9b-tetrahydro-1H-chromeno[4,3-c]isoxazole-1-carboxamide
Type:
Small organic molecule
Emp. Form.:
C14H18N2O3
Mol. Mass.:
262.3043
SMILES:
CC(C)NC(=O)N1OCC2COc3ccccc3C12
: