Target
5-hydroxytryptamine receptor 2B
Ligand
BDBM50325670
Substrate
Meas. Tech.
ChEMBL_652347 (CHEMBL1225550)
Ki
3999±n/a nM
Citation
 Kwon, YJSaubern, SMacdonald, JMHuang, XPSetola, VRoth, BL N-tetrahydrothiochromenoisoxazole-1-carboxamides as selective antagonists of cloned human 5-HT2B. Bioorg Med Chem Lett 20:5488-90 (2010)  
Target
Name:
5-hydroxytryptamine receptor 2B
Synonyms:
5-HT-2B 5-hydroxytryptamine (serotonin) receptor 2B [Homo sapiens] 5-hydroxytryptamine receptor 2C (5HT2C) HTR2B Serotonin 2b (5-HT2b) receptor | Serotonin Receptor 2B
Type:
G Protein-Coupled Receptor (GPCR)
Mol. Mass.:
54312.47
Organism:
Homo sapiens (Human)
Description:
Receptor binding assays were performed using human clone stably expressed in CHO cells.
Residue:
481
  
Inhibitor
Name:
BDBM50325670
Synonyms:
CHEMBL1224106 | N-o-tolyl-3,3a,4,9b-tetrahydro-1H-chromeno[4,3-c]isoxazole-1-carboxamide
Type:
Small organic molecule
Emp. Form.:
C18H18N2O3
Mol. Mass.:
310.3471
SMILES:
Cc1ccccc1NC(=O)N1OCC2COc3ccccc3C12
: