Target
Cytochrome P450 1B1
Ligand
BDBM23419
Substrate
Meas. Tech.
ChEMBL_652515 (CHEMBL1225718)
IC50
3656±n/a nM
Citation
 Takemura, HItoh, TYamamoto, KSakakibara, HShimoi, K Selective inhibition of methoxyflavonoids on human CYP1B1 activity. Bioorg Med Chem 18:6310-5 (2010)  
Target
Name:
Cytochrome P450 1B1
Synonyms:
CP1B1_HUMAN CYPIB1 | Cytochrome P450 1B1 (CYP1B1)
Type:
PROTEIN
Mol. Mass.:
60861.81
Organism:
Homo sapiens (Human)
Description:
ChEMBL_1474523
Residue:
543
  
Inhibitor
Name:
BDBM23419
Synonyms:
(2S)-5,7-dihydroxy-2-(4-hydroxyphenyl)-3,4-dihydro-2H-1-benzopyran-4-one Naringenin
Type:
flavanone
Emp. Form.:
C15H12O5
Mol. Mass.:
272.2528
SMILES:
Oc1ccc(cc1)[C@@H]1CC(=O)c2c(O)cc(O)cc2O1
: