Target
Cytochrome P450 2C9
Ligand
BDBM50325818
Substrate
Meas. Tech.
ChEMBL_652889 (CHEMBL1226092)
IC50
8790±n/a nM
Citation
 Tyagarajan, SChakravarty, PKZhou, BFisher, MHWyvratt, MJLyons, KKlatt, TLi, XKumar, SWilliams, BFelix, JPriest, BTBrochu, RMWarren, VSmith, MGarcia, MKaczorowski, GJMartin, WJAbbadie, CMcGowan, EJochnowitz, NParsons, WH Substituted biaryl oxazoles, imidazoles, and thiazoles as sodium channel blockers. Bioorg Med Chem Lett 20:5536-40 (2010)  
Target
Name:
Cytochrome P450 2C9
Synonyms:
(R)-limonene 6-monooxygenase CP2C9_HUMAN CYP2C9 Cytochrome P450 2C9 (CYP2C9 ) P-450MP P450 PB-1 | S-mephenytoin 4-hydroxylase
Type:
Enzyme
Mol. Mass.:
55636.33
Organism:
Homo sapiens (Human)
Description:
P11712
Residue:
490
  
Inhibitor
Name:
BDBM50325818
Synonyms:
2-(2'-(trifluoromethoxy)biphenyl-3-yl)thiazole-4-carboxamide | CHEMBL1224655
Type:
Small organic molecule
Emp. Form.:
C17H11F3N2O2S
Mol. Mass.:
364.342
SMILES:
NC(=O)c1csc(n1)-c1cccc(c1)-c1ccccc1OC(F)(F)F
: