Target
Melanin-concentrating hormone receptor 1
Ligand
BDBM50325980
Substrate
Meas. Tech.
ChEMBL_654168 (CHEMBL1228974)
IC50
106±n/a nM
Citation
 Sasmal, PKSasmal, SRao, PTVenkatesham, BRoshaiah, MAbbineni, CKhanna, IJadhav, VPSuresh, JTalwar, RMuzeeb, SReceveur, JMFrimurer, TMRist, ØElster, LHögberg, T Discovery of novel, orally available benzimidazoles as melanin concentrating hormone receptor 1 (MCHR1) antagonists. Bioorg Med Chem Lett 20:5443-8 (2010)  
Target
Name:
Melanin-concentrating hormone receptor 1
Synonyms:
G-protein coupled receptor 24 MCH receptor 1 MCH-R1 MCHR-1 MCHR1_HUMAN Melanin-Concentrating Hormone Receptor 1 (MCH1R) Melanin-concentrating hormone receptor 1 (MCH-1) Melanin-concentrating hormone receptor 1 (MCHR-1) SLC-1 Somatostatin receptor-like protein
Type:
G Protein-Coupled Receptor (GPCR)
Mol. Mass.:
45976.27
Organism:
Homo sapiens (Human)
Description:
Membranes from CHO-K1 cells stably expressing human MCH1R were used in assays.
Residue:
422
  
Inhibitor
Name:
BDBM50325980
Synonyms:
1-(4-fluorophenyl)-2-(4-(4-(2-methyl-1H-benzo[d]imidazol-6-yl)piperidin-1-yl)butyl)-1H-benzo[d]imidazole | CHEMBL1224389
Type:
Small organic molecule
Emp. Form.:
C30H32FN5
Mol. Mass.:
481.607
SMILES:
Cc1nc2ccc(cc2[nH]1)C1CCN(CCCCc2nc3ccccc3n2-c2ccc(F)cc2)CC1
: