Target
Ubiquitin carboxyl-terminal hydrolase isozyme L1
Ligand
BDBM50326012
Substrate
Meas. Tech.
ChEMBL_654655 (CHEMBL1243699)
IC50
810±n/a nM
Citation
 Love, KRCatic, ASchlieker, CPloegh, HL Mechanisms, biology and inhibitors of deubiquitinating enzymes. Nat Chem Biol 3:697-705 (2007)  
Target
Name:
Ubiquitin carboxyl-terminal hydrolase isozyme L1
Synonyms:
Neuron cytoplasmic protein 9.5 PGP9.5 UCHL1 Ubiquitin thioesterase L1
Type:
PROTEIN
Mol. Mass.:
24819.03
Organism:
Homo sapiens (Human)
Description:
ChEMBL_974327
Residue:
223
  
Inhibitor
Name:
BDBM50326012
Synonyms:
3-(acetoxyimino)-5-bromo-1-(3,4-dichlorobenzyl)indolin-2-one | CHEMBL1241672
Type:
Small organic molecule
Emp. Form.:
C17H11BrCl2N2O3
Mol. Mass.:
442.091
SMILES:
CC(=O)ON=C1C(=O)N(Cc2ccc(Cl)c(Cl)c2)c2ccc(Br)cc12
: