Target
Receptor tyrosine-protein kinase erbB-2
Ligand
BDBM50279080
Substrate
Meas. Tech.
ChEMBL_655047 (CHEMBL1244091)
IC50
>50000±n/a nM
Citation
 Hilberg, FRoth, GJKrssak, MKautschitsch, SSommergruber, WTontsch-Grunt, UGarin-Chesa, PBader, GZoephel, AQuant, JHeckel, ARettig, WJ BIBF 1120: triple angiokinase inhibitor with sustained receptor blockade and good antitumor efficacy. Cancer Res 68:4774-82 (2008)  
Target
Name:
Receptor tyrosine-protein kinase erbB-2
Synonyms:
2.7.10.1 CD_antigen=CD340 ERBB2_HUMAN FASN/HER2 HER2 MLN19 NEU Proto-oncogene Neu Tyrosine kinase-type cell surface receptor HER2 | p185erbB2
Type:
Mol. Mass.:
137894.47
Organism:
Homo sapiens (Human)
Description:
P04626
Residue:
1255
  
Inhibitor
Name:
BDBM50279080
Synonyms:
(Z)-3-[(4-{Methyl-[2-(4-methylpiperazin-1-yl)acetyl]amino}-phenylamino)-methylene]-2-oxo-2,3-dihydro-1H-indole-6-carboxylicAcid Methyl Ester methyl (3Z)-3-{[(4-{methyl[(4-methylpiperazin-1-yl)acetyl]amino}phenyl)amino](phenyl)methylidene}-2-oxo-2,3-dihydro-1H-indole-6-carboxylate
Type:
Small organic molecule
Emp. Form.:
C31H33N5O4
Mol. Mass.:
539.6248
SMILES:
COC(=O)c1ccc2C(C(=Nc3ccc(cc3)N(C)C(=O)CN3CCN(C)CC3)c3ccccc3)C(=O)Nc2c1
: