Target
LIM domain kinase 1
Ligand
BDBM13216
Substrate
Meas. Tech.
ChEMBL_655543 (CHEMBL1244587)
IC50
114±n/a nM
Citation
 Remsing Rix, LLRix, UColinge, JHantschel, OBennett, KLStranzl, TMüller, ABaumgartner, CValent, PAugustin, MTill, JHSuperti-Furga, G Global target profile of the kinase inhibitor bosutinib in primary chronic myeloid leukemia cells. Leukemia 23:477-85 (2009)  
Target
Name:
LIM domain kinase 1
Synonyms:
LIMK LIMK1 | LIMK1_HUMAN
Type:
Enzyme Catalytic Domain
Mol. Mass.:
72591.81
Organism:
Homo sapiens (Human)
Description:
gi_4505001
Residue:
647
  
Inhibitor
Name:
BDBM13216
Synonyms:
BMS-354825 DASATINIB N-(2-chloro-6-methylphenyl)-2-({6-[4-(2-hydroxyethyl)piperazin-1-yl]-2-methylpyrimidin-4-yl}amino)-1,3-thiazole-5-carboxamide US20230348453, Compound A8 med.21724, Compound Dasatinib
Type:
Small organic molecule
Emp. Form.:
C22H26ClN7O2S
Mol. Mass.:
488.006
SMILES:
Cc1nc(Nc2ncc(s2)C(=O)Nc2c(C)cccc2Cl)cc(n1)N1CCN(CCO)CC1
: