Target
Tyrosine-protein kinase Fyn
Ligand
BDBM50326053
Substrate
Meas. Tech.
ChEMBL_655809 (CHEMBL1244853)
Kd
2100±n/a nM
Citation
 Zarrinkar, PPGunawardane, RNCramer, MDGardner, MFBrigham, DBelli, BKaraman, MWPratz, KWPallares, GChao, QSprankle, KGPatel, HKLevis, MArmstrong, RCJames, JBhagwat, SS AC220 is a uniquely potent and selective inhibitor of FLT3 for the treatment of acute myeloid leukemia (AML). Blood 114:2984-92 (2009)  
Target
Name:
Tyrosine-protein kinase Fyn
Synonyms:
FYN Proto-oncogene Syn SLK Src-like kinase | p59-Fyn
Type:
Enzyme
Mol. Mass.:
60762.21
Organism:
Homo sapiens (Human)
Description:
P06241
Residue:
537
  
Inhibitor
Name:
BDBM50326053
Synonyms:
CHEMBL608533 | PKC-412
Type:
Small organic molecule
Emp. Form.:
C35H30N4O4
Mol. Mass.:
570.6371
SMILES:
CO[C@@H]1[C@@H](C[C@H]2O[C@]1(C)n1c3ccccc3c3c4CNC(=O)c4c4c5ccccc5n2c4c13)N(C)C(=O)c1ccccc1
: