Target
Citron Rho-interacting kinase
Ligand
BDBM50326054
Substrate
Meas. Tech.
ChEMBL_655725 (CHEMBL1244769)
Kd
>10000±n/a nM
Citation
 Zarrinkar, PPGunawardane, RNCramer, MDGardner, MFBrigham, DBelli, BKaraman, MWPratz, KWPallares, GChao, QSprankle, KGPatel, HKLevis, MArmstrong, RCJames, JBhagwat, SS AC220 is a uniquely potent and selective inhibitor of FLT3 for the treatment of acute myeloid leukemia (AML). Blood 114:2984-92 (2009)  
Target
Name:
Citron Rho-interacting kinase
Synonyms:
CIT CTRO_HUMAN STK21
Type:
PROTEIN
Mol. Mass.:
231428.89
Organism:
Homo sapiens (Human)
Description:
ChEMBL_774545
Residue:
2027
  
Inhibitor
Name:
BDBM50326054
Synonyms:
CHEMBL1240703
Type:
Small organic molecule
Emp. Form.:
C35H30N4O5
Mol. Mass.:
586.6365
SMILES:
CO[C@@H]1[C@@H](C[C@H]2O[C@]1(C)n1c3ccccc3c3c4[C@H](O)NC(=O)c4c4c5ccccc5n2c4c13)N(C)C(=O)c1ccccc1
: