Target
Carbonic anhydrase 2
Ligand
BDBM50326115
Substrate
Meas. Tech.
ChEMBL_659851 (CHEMBL1246741)
Ki
112±n/a nM
Citation
 Brzozowski, ZSlawinski, JInnocenti, ASupuran, CT Carbonic anhydrase inhibitors. Regioselective synthesis of novel 1-substituted 1,4-dihydro-4-oxo-3-pyridinesulfonamides and their inhibition of the human cytosolic isozymes I and II and transmembrane cancer-associated isozymes IX and XII. Eur J Med Chem 45:3656-61 (2010)  
Target
Name:
Carbonic anhydrase 2
Synonyms:
CA-II CAC Carbonate dehydratase II Carbonic anhydrase 2 (CA-II) Carbonic anhydrase C Carbonic anhydrase II (CA-II) Carbonic anhydrase II (hCA II) | Carbonic anhydrase isoenzyme II (hCA II)
Type:
Enzyme
Mol. Mass.:
29250.71
Organism:
Homo sapiens (Human)
Description:
P00918
Residue:
260
  
Inhibitor
Name:
BDBM50326115
Synonyms:
1-(4-Chlorophenacyl)-1,4-dihydro-4-oxo-3-pyridinesulfonamide | CHEMBL1242704
Type:
Small organic molecule
Emp. Form.:
C13H11ClN2O4S
Mol. Mass.:
326.755
SMILES:
NS(=O)(=O)c1cn(CC(=O)c2ccc(Cl)cc2)ccc1=O
: