Target
Transcription factor Jun
Ligand
BDBM50326119
Substrate
Meas. Tech.
ChEMBL_657293 (CHEMBL1249120)
IC50
5700±n/a nM
Citation
 Giri, RSThaker, HMGiordano, TChen, BNuthalapaty, SVasu, KKSudarsanam, V Synthesis and evaluation of quinazolinone derivatives as inhibitors of NF-kappaB, AP-1 mediated transcription and eIF-4E mediated translational activation: inhibitors of multi-pathways involve in cancer. Eur J Med Chem 45:3558-63 (2010)  
Target
Name:
Transcription factor Jun
Synonyms:
AP1 JUN Proto-oncogene c-JUN Transcription factor AP1 p39
Type:
Mol. Mass.:
35683.24
Organism:
Homo sapiens (Human)
Description:
P05412
Residue:
331
  
Inhibitor
Name:
BDBM50326119
Synonyms:
CHEMBL1242070 | [5-(4-Oxo-3-phenyl-3,4-dihydro-quinazolin-2-yl)-4-phenylthiazol-2-yl]-carbamic acid ethyl ester
Type:
Small organic molecule
Emp. Form.:
C26H20N4O3S
Mol. Mass.:
468.527
SMILES:
CCOC(=O)Nc1nc(c(s1)-c1nc2ccccc2c(=O)n1-c1ccccc1)-c1ccccc1
: