Target
Receptor-type tyrosine-protein phosphatase F
Ligand
BDBM50326151
Substrate
Meas. Tech.
ChEMBL_658719 (CHEMBL1248460)
IC50
1323±n/a nM
Citation
 Lakshminarayana, NPrasad, YRGharat, LThomas, ANarayanan, SRaghuram, ASrinivasan, CVGopalan, B Synthesis and evaluation of some novel dibenzo[b,d]furan carboxylic acids as potential anti-diabetic agents. Eur J Med Chem 45:3709-18 (2010)  
Target
Name:
Receptor-type tyrosine-protein phosphatase F
Synonyms:
LAR Leukocyte common antigen related (LAR) PTPRF_HUMAN Receptor-type tyrosine-protein phosphatase F (LAR)
Type:
Protein
Mol. Mass.:
212869.85
Organism:
Homo sapiens (Human)
Description:
P10586
Residue:
1907
  
Inhibitor
Name:
BDBM50326151
Synonyms:
8-(2-Methylthiazol-4-yl)dibenzo[b,d]furan-4-carboxylic acid | CHEMBL1242458
Type:
Small organic molecule
Emp. Form.:
C23H15NO3S
Mol. Mass.:
385.435
SMILES:
Cc1ccc(cc1)-c1nc(cs1)-c1ccc2oc3c(cccc3c2c1)C(O)=O
: