Target
Receptor-type tyrosine-protein phosphatase F
Ligand
BDBM50326157
Substrate
Meas. Tech.
ChEMBL_658719 (CHEMBL1248460)
IC50
2942±n/a nM
Citation
 Lakshminarayana, NPrasad, YRGharat, LThomas, ANarayanan, SRaghuram, ASrinivasan, CVGopalan, B Synthesis and evaluation of some novel dibenzo[b,d]furan carboxylic acids as potential anti-diabetic agents. Eur J Med Chem 45:3709-18 (2010)  
Target
Name:
Receptor-type tyrosine-protein phosphatase F
Synonyms:
LAR Leukocyte common antigen related (LAR) PTPRF_HUMAN Receptor-type tyrosine-protein phosphatase F (LAR)
Type:
Protein
Mol. Mass.:
212869.85
Organism:
Homo sapiens (Human)
Description:
P10586
Residue:
1907
  
Inhibitor
Name:
BDBM50326157
Synonyms:
8-[2-(4-Morpholinophenyl)thiazol-4-yl]dibenzo[b,d]furan-4-carboxylic acid | CHEMBL1242642
Type:
Small organic molecule
Emp. Form.:
C26H20N2O4S
Mol. Mass.:
456.513
SMILES:
OC(=O)c1cccc2c3cc(ccc3oc12)-c1csc(n1)-c1ccc(cc1)N1CCOCC1
: