Target
Receptor-type tyrosine-protein phosphatase F
Ligand
BDBM50326160
Substrate
Meas. Tech.
ChEMBL_658719 (CHEMBL1248460)
IC50
3574±n/a nM
Citation
 Lakshminarayana, NPrasad, YRGharat, LThomas, ANarayanan, SRaghuram, ASrinivasan, CVGopalan, B Synthesis and evaluation of some novel dibenzo[b,d]furan carboxylic acids as potential anti-diabetic agents. Eur J Med Chem 45:3709-18 (2010)  
Target
Name:
Receptor-type tyrosine-protein phosphatase F
Synonyms:
LAR Leukocyte common antigen related (LAR) PTPRF_HUMAN Receptor-type tyrosine-protein phosphatase F (LAR)
Type:
Protein
Mol. Mass.:
212869.85
Organism:
Homo sapiens (Human)
Description:
P10586
Residue:
1907
  
Inhibitor
Name:
BDBM50326160
Synonyms:
8-[2-(3,5-Dibromo-4-(1-carboxy-2-phenylethoxy)phenyl)thiazol-4-yl]dibenzo[b,d]furan-4-carboxylic acid | CHEMBL1241314
Type:
Small organic molecule
Emp. Form.:
C32H19Br2NO6S
Mol. Mass.:
705.369
SMILES:
OC(=O)[C@@H](Cc1ccccc1)C(=O)c1c(Br)cc(cc1Br)-c1nc(cs1)-c1ccc2oc3c(cccc3c2c1)C(O)=O
: