Target
Histone deacetylase 1
Ligand
BDBM50326167
Substrate
Meas. Tech.
ChEMBL_658912 (CHEMBL1246051)
IC50
4950±n/a nM
Citation
 Conti, PTamborini, LPinto, ASola, LEttari, RMercurio, CDe Micheli, C Design and synthesis of novel isoxazole-based HDAC inhibitors. Eur J Med Chem 45:4331-8 (2010)  
Target
Name:
Histone deacetylase 1
Synonyms:
Cereblon/Histone deacetylase 1 HDAC1 Histone deacetylase 1 (HDAC1) RPD3L1
Type:
Enzyme
Mol. Mass.:
55090.27
Organism:
Homo sapiens (Human)
Description:
Q13547
Residue:
482
  
Inhibitor
Name:
BDBM50326167
Synonyms:
CHEMBL1243261 | N-Hydroxy-5-[5-oxo-5-(phenylamino)pentyl]isoxazole-3-carboxamide
Type:
Small organic molecule
Emp. Form.:
C15H17N3O4
Mol. Mass.:
303.3132
SMILES:
ONC(=O)c1cc(CCCCC(=O)Nc2ccccc2)on1
: