Target
Cyclin-dependent kinase 1
Ligand
BDBM50326174
Substrate
Meas. Tech.
ChEMBL_658925 (CHEMBL1246064)
IC50
2500±n/a nM
Citation
 Al-Sha'er, MATaha, MO Discovery of novel CDK1 inhibitors by combining pharmacophore modeling, QSAR analysis and in silico screening followed by in vitro bioassay. Eur J Med Chem 45:4316-30 (2010)  
Target
Name:
Cyclin-dependent kinase 1
Synonyms:
CDC2 CDK1 CDKN1 Cell division protein kinase 1 P34CDC2 | p34 protein kinase
Type:
Enzyme Subunit
Mol. Mass.:
34101.08
Organism:
Homo sapiens (Human)
Description:
P06493
Residue:
297
  
Inhibitor
Name:
BDBM50326174
Synonyms:
2-hydroxyethyl 3,4-dichlorophenylcarbamodithioate | CHEMBL1240761
Type:
Small organic molecule
Emp. Form.:
C9H9Cl2NOS2
Mol. Mass.:
282.21
SMILES:
OCCSC(=S)Nc1ccc(Cl)c(Cl)c1
: