Target
Alpha-1A adrenergic receptor
Ligand
BDBM50326197
Substrate
Meas. Tech.
ChEMBL_659313 (CHEMBL1247777)
Ki
885±n/a nM
Citation
 Sakurada, TGill, MBFrausto, SCopits, BNoguchi, KShimamoto, KSwanson, GTSakai, R Novel N-methylated 8-oxoisoguanines from Pacific sponges with diverse neuroactivities. J Med Chem 53:6089-99 (2010)  
Target
Name:
Alpha-1A adrenergic receptor
Synonyms:
ADA1A_HUMAN ADRA1C Alpha 1A-adrenoceptor Alpha adrenergic receptor 1a Alpha-adrenergic receptor 1c adrenergic Alpha1 | adrenergic Alpha1C
Type:
Cell-surface receptors
Mol. Mass.:
51511.67
Organism:
Homo sapiens (Human)
Description:
P35348
Residue:
466
  
Inhibitor
Name:
BDBM50326197
Synonyms:
1,9-dimethyl-2,8-dioxo-2,3,8,9-tetrahydro-1H-purin-6(7H)-iminium chloride | CHEMBL1241328
Type:
Small organic molecule
Emp. Form.:
C7H9N5O2
Mol. Mass.:
195.1787
SMILES:
Cn1c2nc(=O)n(C)c(N)c2[nH]c1=O
: