Target
Aurora kinase B
Ligand
BDBM50326208
Substrate
Meas. Tech.
ChEMBL_659351 (CHEMBL1247978)
EC50
24±n/a nM
Citation
 Cee, VJSchenkel, LBHodous, BLDeak, HLNguyen, HNOlivieri, PRRomero, KBak, ABe, XBellon, SBush, TLCheng, ACChung, GCoats, SEden, PMHanestad, KGallant, PLGu, YHuang, XKendall, RLLin, MHMorrison, MJPatel, VFRadinsky, RRose, PERoss, SSun, JRTang, JZhao, HPayton, MGeuns-Meyer, SD Discovery of a potent, selective, and orally bioavailable pyridinyl-pyrimidine phthalazine aurora kinase inhibitor. J Med Chem 53:6368-77 (2010)  
Target
Name:
Aurora kinase B
Synonyms:
AIK2 AIM1 ARK2 AURKB_HUMAN Aurora B-INCENP Aurora kinase B (AURKB) STK-1 STK12 Serine/threonine-protein kinase aurora B
Type:
Protein
Mol. Mass.:
39327.72
Organism:
Homo sapiens (Human)
Description:
Q96GD4
Residue:
344
  
Inhibitor
Name:
BDBM50326208
Synonyms:
4-(4-Fluorophenyl)-N-(4-(3-(2-(methylamino)pyrimidin-4-yl)-pyridin-2-yloxy)phenyl)phthalazin-1-amine | CHEMBL1243326
Type:
Small organic molecule
Emp. Form.:
C30H22FN7O
Mol. Mass.:
515.5404
SMILES:
CNc1nccc(n1)-c1cccnc1Oc1ccc(Nc2nnc(-c3ccc(F)cc3)c3ccccc23)cc1
: