Target
E3 ubiquitin-protein ligase XIAP
Ligand
BDBM50273699
Substrate
Meas. Tech.
ChEMBL_659379 (CHEMBL1248006)
Ki
110.9±n/a nM
Citation
 Sun, HLu, JLiu, LYi, HQiu, SYang, CYDeschamps, JRWang, S Nonpeptidic and potent small-molecule inhibitors of cIAP-1/2 and XIAP proteins. J Med Chem 53:6361-7 (2010)  
Target
Name:
E3 ubiquitin-protein ligase XIAP
Synonyms:
API3 E3 ubiquitin-protein ligase XIAP Inhibitor of apoptosis protein 3 X-linked inhibitor of apoptosis XIAP | XIAP_HUMAN
Type:
Protein
Mol. Mass.:
56685.27
Organism:
Homo sapiens (Human)
Description:
P98170
Residue:
497
  
Inhibitor
Name:
BDBM50273699
Synonyms:
(5S,8S,10aR)-N-Benzhydryl-5-((S)-2-(methyl-amino)propanamido)-6-oxo-3-(2-phenyl-acetyl)decahydropyrrolo[1,2-a][1,5]diazocine-8-carboxamide SM-337
Type:
Small organic molecule
Emp. Form.:
C35H41N5O4
Mol. Mass.:
595.7311
SMILES:
CN[C@@H](C)C(=O)N[C@H]1CN(CC[C@H]2CC[C@H](N2C1=O)C(=O)NC(c1ccccc1)c1ccccc1)C(=O)Cc1ccccc1
: