Target
Enoyl-acyl carrier reductase ENR
Ligand
BDBM50326330
Substrate
Meas. Tech.
ChEMBL_657369 (CHEMBL1246345)
IC50
>20000±n/a nM
Citation
 Tipparaju, SKMuench, SPMui, EJRuzheinikov, SNLu, JZHutson, SLKirisits, MJPrigge, STRoberts, CWHenriquez, FLKozikowski, APRice, DWMcLeod, RL Identification and development of novel inhibitors of Toxoplasma gondii enoyl reductase. J Med Chem 53:6287-300 (2010)  
Target
Name:
Enoyl-acyl carrier reductase ENR
Synonyms:
Enoyl-acyl carrier reductase Enoyl-acyl carrier reductase, putative
Type:
PROTEIN
Mol. Mass.:
43663.67
Organism:
Toxoplasma gondii
Description:
ChEMBL_1290812
Residue:
417
  
Inhibitor
Name:
BDBM50326330
Synonyms:
5-chloro-2-phenoxyaniline | CHEMBL1240673
Type:
Small organic molecule
Emp. Form.:
C12H10ClNO
Mol. Mass.:
219.667
SMILES:
Nc1cc(Cl)ccc1Oc1ccccc1
: