Target
S-methyl-5'-thioadenosine phosphorylase
Ligand
BDBM50326404
Substrate
Meas. Tech.
ChEMBL_657428 (CHEMBL1246404)
Ki
14±n/a nM
Citation
 Longshaw, AIAdanitsch, FGutierrez, JAEvans, GBTyler, PCSchramm, VL Design and synthesis of potent"sulfur-free" transition state analogue inhibitors of 5'-methylthioadenosine nucleosidase and 5'-methylthioadenosine phosphorylase. J Med Chem 53:6730-46 (2010)  
Target
Name:
S-methyl-5'-thioadenosine phosphorylase
Synonyms:
5'-Methylthioadenosine phosphorylase (MTAP) MTA phosphorylase MTAP_HUMAN Methylthioadenosine Phosphorylase (MTAP) | S-methyl-5 -thioadenosine phosphorylase
Type:
Enzyme
Mol. Mass.:
31239.23
Organism:
Homo sapiens (Human)
Description:
Residue:
283
  
Inhibitor
Name:
BDBM50326404
Synonyms:
(+/-)-trans-4-(Cyclohexylmethyl)-1-[(9-deaza-adenin-9-yl)methyl]-3-hydroxypyrrolidine | CHEMBL1243280
Type:
Small organic molecule
Emp. Form.:
C18H27N5O
Mol. Mass.:
329.4399
SMILES:
Nc1ncnc2c(CN3C[C@H](O)[C@@H](CC4CCCCC4)C3)c[nH]c12
: