Target
MAP kinase-interacting serine/threonine-protein kinase 1
Ligand
BDBM50326425
Substrate
Meas. Tech.
ChEMBL_657431 (CHEMBL1246407)
IC50
1710±n/a nM
Citation
 Oyarzabal, JZarich, NAlbarran, MIPalacios, IUrbano-Cuadrado, MMateos, GReymundo, IRabal, OSalgado, ACorrionero, AFominaya, JPastor, JBischoff, JR Discovery of mitogen-activated protein kinase-interacting kinase 1 inhibitors by a comprehensive fragment-oriented virtual screening approach. J Med Chem 53:6618-28 (2010)  
Target
Name:
MAP kinase-interacting serine/threonine-protein kinase 1
Synonyms:
MAP Kinase-Interacting Protein Kinase (MNK1) MAP kinase-interacting serine/threonine-protein kinase 1 (MnK1) MAP-kinase interacting kinase 1 (MNK1) MKNK1 MNK1
Type:
Serine/threonine-protein kinase
Mol. Mass.:
51342.85
Organism:
Homo sapiens (Human)
Description:
Q9BUB5
Residue:
465
  
Inhibitor
Name:
BDBM50326425
Synonyms:
CHEMBL1240674 | N-(cyclopropylmethyl)-5-(pyridin-4-yl)imidazo[2,1-b][1,3,4]thiadiazol-2-amine
Type:
Small organic molecule
Emp. Form.:
C13H13N5S
Mol. Mass.:
271.341
SMILES:
C(Nc1nn2c(cnc2s1)-c1ccncc1)C1CC1
: