Target
Serine/threonine-protein kinase pim-2
Ligand
BDBM50299249
Substrate
Meas. Tech.
ChEMBL_657900 (CHEMBL1248424)
IC50
510±n/a nM
Citation
 Akué-Gédu, RNauton, LThéry, VBain, JCohen, PAnizon, FMoreau, P Synthesis, Pim kinase inhibitory potencies and in vitro antiproliferative activities of diversely substituted pyrrolo[2,3-a]carbazoles. Bioorg Med Chem 18:6865-73 (2010)  
Target
Name:
Serine/threonine-protein kinase pim-2
Synonyms:
PIM2 Pim-2h Serine/threonine-protein kinase PIM | Serine/threonine-protein kinase pim-2 (PIM2)
Type:
Serine/threonine-protein kinase
Mol. Mass.:
34185.93
Organism:
Homo sapiens (Human)
Description:
Q9P1W9
Residue:
311
  
Inhibitor
Name:
BDBM50299249
Synonyms:
1,10-Dihydropyrrolo[2,3-a]carbazole-3-carbaldehyde US8481586, 3
Type:
Small organic molecule
Emp. Form.:
C15H10N2O
Mol. Mass.:
234.2527
SMILES:
O=Cc1c[nH]c2c1ccc1c3ccccc3[nH]c21
: