Target
NADPH oxidase 4
Ligand
BDBM7458
Substrate
Meas. Tech.
ChEMBL_658093 (CHEMBL1249158)
IC50
1130±n/a nM
Citation
 Borbély, GSzabadkai, IHorváth, ZMarkó, PVarga, ZBreza, NBaska, FVántus, THuszár, MGeiszt, MHunyady, LBuday, LOrfi, LKéri, G Small-molecule inhibitors of NADPH oxidase 4. J Med Chem 53:6758-62 (2010)  
Target
Name:
NADPH oxidase 4
Synonyms:
KOX-1 Kidney superoxide-producing NADPH oxidase NOX4_HUMAN Renal NAD(P)H-oxidase
Type:
PROTEIN
Mol. Mass.:
66954.54
Organism:
Homo sapiens (Human)
Description:
ChEMBL_792879
Residue:
578
  
Inhibitor
Name:
BDBM7458
Synonyms:
5,7-dihydroxy-2-(4-hydroxyphenyl)-4H-chromen-4-one Apigenin Apigenin (3) Apigenin, 13 Naringenin, 18 US11337935, Compound Apigenin cid_5280443 | jm5b01461, Compound 90
Type:
Small organic molecule
Emp. Form.:
C15H10O5
Mol. Mass.:
270.2369
SMILES:
Oc1ccc(cc1)-c1cc(=O)c2c(O)cc(O)cc2o1
: