Target
NADPH oxidase 4
Ligand
BDBM4085
Substrate
Meas. Tech.
ChEMBL_658093 (CHEMBL1249158)
IC50
1580±n/a nM
Citation
 Borbély, GSzabadkai, IHorváth, ZMarkó, PVarga, ZBreza, NBaska, FVántus, THuszár, MGeiszt, MHunyady, LBuday, LOrfi, LKéri, G Small-molecule inhibitors of NADPH oxidase 4. J Med Chem 53:6758-62 (2010)  
Target
Name:
NADPH oxidase 4
Synonyms:
KOX-1 Kidney superoxide-producing NADPH oxidase NOX4_HUMAN Renal NAD(P)H-oxidase
Type:
PROTEIN
Mol. Mass.:
66954.54
Organism:
Homo sapiens (Human)
Description:
ChEMBL_792879
Residue:
578
  
Inhibitor
Name:
BDBM4085
Synonyms:
2,3,8,9-tetrahydroxy-5-[(4-nitrophenyl)methyl]-5,6-dihydrophenanthridin-6-one | Phenanthridinone deriv. 5g
Type:
Small organic molecule
Emp. Form.:
C20H14N2O7
Mol. Mass.:
394.3344
SMILES:
Oc1cc2n(Cc3ccc(cc3)[N+]([O-])=O)c(=O)c3cc(O)c(O)cc3c2cc1O
: