Target
RAC-alpha serine/threonine-protein kinase
Ligand
BDBM15131
Substrate
Meas. Tech.
ChEMBL_662179 (CHEMBL1252170)
Ki
0.16±n/a nM
Citation
 Okuzumi, TFiedler, DZhang, CGray, DCAizenstein, BHoffman, RShokat, KM Inhibitor hijacking of Akt activation. Nat Chem Biol 5:484-93 (2009)  
Target
Name:
RAC-alpha serine/threonine-protein kinase
Synonyms:
AKT phosphorylation (p-AKT) AKT1/PPP1CA C-AKT PKB alpha Protein kinase B Protein kinase B (Akt 1) Protein kinase B alpha Proto-oncogene Akt (Akt1) Proto-oncogene c-Akt (AKT1) RAC-PK-alpha RAC-alpha serine/threonine-protein kinase (AKT1) | RAC-alpha serine/threonine-protein kinase (pAKT)
Type:
Enzyme
Mol. Mass.:
55681.25
Organism:
Homo sapiens (Human)
Description:
P31749
Residue:
480
  
Inhibitor
Name:
BDBM15131
Synonyms:
5-indazolyl pyridine 3 A-443654 | indazole-pyridine, 4
Type:
Small organic molecule
Emp. Form.:
C24H23N5O
Mol. Mass.:
397.4723
SMILES:
Cc1n[nH]c2ccc(cc12)-c1cncc(OC[C@@H](N)Cc2c[nH]c3ccccc23)c1
: