Target
Vasopressin V1a receptor
Ligand
BDBM50045130
Substrate
Meas. Tech.
ChEMBL_661539 (CHEMBL1253103)
Ki
32±n/a nM
Citation
 Borthwick, AD Oral oxytocin antagonists. J Med Chem 53:6525-38 (2010)  
Target
Name:
Vasopressin V1a receptor
Synonyms:
Avpr1a VASOPRESSIN V1A Vasopressin V1a receptor | Vasopressin receptor
Type:
Enzyme Catalytic Domain
Mol. Mass.:
47674.81
Organism:
RAT
Description:
VASOPRESSIN V1A AVPR1A RAT::P30560
Residue:
424
  
Inhibitor
Name:
BDBM50045130
Synonyms:
CHEMBL60954 | N-(2-{4-[4-(2-Oxo-3,4-dihydro-2H-quinolin-1-yl)-piperidine-1-carbonyl]-phenoxy}-ethyl)-acetamide
Type:
Small organic molecule
Emp. Form.:
C25H29N3O4
Mol. Mass.:
435.5155
SMILES:
CC(=O)NCCOc1ccc(cc1)C(=O)N1CCC(CC1)N1C(=O)CCc2ccccc12
: