Target
Vasopressin V1b receptor
Ligand
BDBM50326717
Substrate
Meas. Tech.
ChEMBL_661576 (CHEMBL1253140)
Ki
>10000±n/a nM
Citation
 Borthwick, AD Oral oxytocin antagonists. J Med Chem 53:6525-38 (2010)  
Target
Name:
Vasopressin V1b receptor
Synonyms:
AVPR V1b AVPR1B Antidiuretic hormone receptor 1b V1bR VPR3 Vasopressin V1b receptor (V1b) Vasopressin V3 receptor
Type:
Enzyme
Mol. Mass.:
46985.01
Organism:
Homo sapiens (Human)
Description:
P47901
Residue:
424
  
Inhibitor
Name:
BDBM50326717
Synonyms:
4-ethoxy-N-(2-oxo-2-(2-(2-oxoindolin-3-ylidene)hydrazinyl)ethyl)-N-p-tolylbenzenesulfonamide | CHEMBL1254117
Type:
Small organic molecule
Emp. Form.:
C25H24N4O5S
Mol. Mass.:
492.547
SMILES:
CCOc1ccc(cc1)S(=O)(=O)N(CC(=O)NN=C1C(=O)Nc2ccccc12)c1ccc(C)cc1
: