Target
Metabotropic glutamate receptor 1
Ligand
BDBM50326793
Substrate
Meas. Tech.
ChEMBL_661795 (CHEMBL1252028)
EC50
>100000±n/a nM
Citation
 Stanley, NJHutchinson, MRKvist, TNielsen, BMathiesen, JMBräuner-Osborne, HAvery, TDTiekink, ERPedersen, DSIrvine, RJAbell, ADTaylor, DK A new metabotropic glutamate receptor agonist with in vivo anti-allodynic activity. Bioorg Med Chem 18:6089-98 (2010)  
Target
Name:
Metabotropic glutamate receptor 1
Synonyms:
GPRC1A GRM1_HUMAN Metabotropic Glutamate 1a | metabotropic glutamate 1
Type:
Enzyme
Mol. Mass.:
132358.19
Organism:
Homo sapiens (Human)
Description:
Q13255
Residue:
1194
  
Inhibitor
Name:
BDBM50326793
Synonyms:
(+/-)(1S,2S,3R)-2-[(S)-Amino(carboxy)methyl]-3-cyclohexylcyclopropanecarboxylic acid | CHEMBL1253502
Type:
Small organic molecule
Emp. Form.:
C12H19NO4
Mol. Mass.:
241.2836
SMILES:
N[C@@H]([C@H]1[C@H]([C@@H]1C(O)=O)C1CCCCC1)C(O)=O
: