Target
Somatostatin receptor type 2
Ligand
BDBM50326856
Substrate
Meas. Tech.
ChEMBL_662923 (CHEMBL1252084)
IC50
3320±n/a nM
Citation
 Abbenante, GBecker, BBlanc, SClark, CCondie, GFraser, GGrathwohl, MHalliday, JHenderson, SLam, ALiu, LMann, MMuldoon, CPearson, APremraj, RRamsdale, TRossetti, TSchafer, KLe Thanh, GTometzki, GVari, FVerquin, GWaanders, JWest, MWimmer, NYau, AZuegg, JMeutermans, W Biological diversity from a structurally diverse library: systematically scanning conformational space using a pyranose scaffold. J Med Chem 53:5576-86 (2010)  
Target
Name:
Somatostatin receptor type 2
Synonyms:
SOMATOSTATIN SST2 SS-2-R SS2R SSTR2 | Somatostatin receptor type 2 (SSTR2)
Type:
Enzyme
Mol. Mass.:
41344.94
Organism:
Homo sapiens (Human)
Description:
P30874
Residue:
369
  
Inhibitor
Name:
BDBM50326856
Synonyms:
4-amino-N-((2R,3R,4R,5S,6R)-5-hydroxy-6-(methoxymethyl)-4-(naphthalen-2-ylmethoxy)-2-phenethoxytetrahydro-2H-pyran-3-yl)butanamide | CHEMBL1254395
Type:
Small organic molecule
Emp. Form.:
C30H38N2O6
Mol. Mass.:
522.6325
SMILES:
COC[C@H]1O[C@@H](OCCc2ccccc2)[C@H](NC(=O)CCCN)[C@@H](OCc2ccc3ccccc3c2)[C@@H]1O
: