Target
Somatostatin receptor type 3
Ligand
BDBM50326873
Substrate
Meas. Tech.
ChEMBL_662924 (CHEMBL1252085)
IC50
6330±n/a nM
Citation
 Abbenante, GBecker, BBlanc, SClark, CCondie, GFraser, GGrathwohl, MHalliday, JHenderson, SLam, ALiu, LMann, MMuldoon, CPearson, APremraj, RRamsdale, TRossetti, TSchafer, KLe Thanh, GTometzki, GVari, FVerquin, GWaanders, JWest, MWimmer, NYau, AZuegg, JMeutermans, W Biological diversity from a structurally diverse library: systematically scanning conformational space using a pyranose scaffold. J Med Chem 53:5576-86 (2010)  
Target
Name:
Somatostatin receptor type 3
Synonyms:
SOMATOSTATIN SST3 SS3-R SSR-28 SSTR3 | Somatostatin receptor type 3 (SSTR3)
Type:
Protein
Mol. Mass.:
45855.97
Organism:
Homo sapiens (Human)
Description:
P32745
Residue:
418
  
Inhibitor
Name:
BDBM50326873
Synonyms:
3-amino-N-((2S,3R,4S,5S,6R)-6-((4-chlorobenzyloxy)methyl)-5-hydroxy-2-(methylthio)-4-(naphthalen-2-ylmethoxy)tetrahydro-2H-pyran-3-yl)propanamide | CHEMBL1254967
Type:
Small organic molecule
Emp. Form.:
C28H33ClN2O5S
Mol. Mass.:
545.09
SMILES:
CS[C@@H]1O[C@H](COCc2ccc(Cl)cc2)[C@@H](O)[C@@H](OCc2ccc3ccccc3c2)[C@H]1NC(=O)CCN
: