Target
Somatostatin receptor type 3
Ligand
BDBM50326855
Substrate
Meas. Tech.
ChEMBL_662924 (CHEMBL1252085)
IC50
8400±n/a nM
Citation
 Abbenante, GBecker, BBlanc, SClark, CCondie, GFraser, GGrathwohl, MHalliday, JHenderson, SLam, ALiu, LMann, MMuldoon, CPearson, APremraj, RRamsdale, TRossetti, TSchafer, KLe Thanh, GTometzki, GVari, FVerquin, GWaanders, JWest, MWimmer, NYau, AZuegg, JMeutermans, W Biological diversity from a structurally diverse library: systematically scanning conformational space using a pyranose scaffold. J Med Chem 53:5576-86 (2010)  
Target
Name:
Somatostatin receptor type 3
Synonyms:
SOMATOSTATIN SST3 SS3-R SSR-28 SSTR3 | Somatostatin receptor type 3 (SSTR3)
Type:
Protein
Mol. Mass.:
45855.97
Organism:
Homo sapiens (Human)
Description:
P32745
Residue:
418
  
Inhibitor
Name:
BDBM50326855
Synonyms:
4-amino-N-((2S,3R,4S,5S,6R)-5-hydroxy-6-(methoxymethyl)-4-(naphthalen-2-ylmethoxy)-2-phenethoxytetrahydro-2H-pyran-3-yl)butanamide | CHEMBL1254321
Type:
Small organic molecule
Emp. Form.:
C30H38N2O6
Mol. Mass.:
522.6325
SMILES:
COC[C@H]1O[C@H](OCCc2ccccc2)[C@H](NC(=O)CCCN)[C@H](OCc2ccc3ccccc3c2)[C@@H]1O
: