Target
Amine oxidase [flavin-containing] B
Ligand
BDBM29136
Substrate
Meas. Tech.
ChEMBL_663025 (CHEMBL1250928)
IC50
7540±n/a nM
Citation
 Maccioni, EAlcaro, SOrallo, FCardia, MCDistinto, SCosta, GYanez, MSanna, MLVigo, SMeleddu, RSecci, D Synthesis of new 3-aryl-4,5-dihydropyrazole-1-carbothioamide derivatives. An investigation on their ability to inhibit monoamine oxidase. Eur J Med Chem 45:4490-8 (2010)  
Target
Name:
Amine oxidase [flavin-containing] B
Synonyms:
AOFB_HUMAN MAOB Monoamine oxidase type B (MAO B) Monoamine oxidase type B (MAOB)
Type:
Protein
Mol. Mass.:
58768.76
Organism:
Homo sapiens (Human)
Description:
P27338
Residue:
520
  
Inhibitor
Name:
BDBM29136
Synonyms:
CHEMBL92401 Iprazid | Iproniazid
Type:
Small organic molecule
Emp. Form.:
C9H13N3O
Mol. Mass.:
179.219
SMILES:
CC(C)NNC(=O)c1ccncc1
: