Target
Potassium/sodium hyperpolarization-activated cyclic nucleotide-gated channel 1
Ligand
BDBM50326991
Substrate
Meas. Tech.
ChEMBL_663436 (CHEMBL1250984)
EC50
2310±n/a nM
Citation
 Melchiorre, MDel Lungo, MGuandalini, LMartini, EDei, SManetti, DScapecchi, STeodori, ESartiani, LMugelli, ACerbai, ERomanelli, MN Design, synthesis, and preliminary biological evaluation of new isoform-selective f-current blockers. J Med Chem 53:6773-7 (2010)  
Target
Name:
Potassium/sodium hyperpolarization-activated cyclic nucleotide-gated channel 1
Synonyms:
BCNG-1 Brain cyclic nucleotide-gated channel 1 HCN1_MOUSE Hcn1 | Hyperpolarization-activated cation channel 2
Type:
PROTEIN
Mol. Mass.:
102447.84
Organism:
Mus musculus
Description:
ChEMBL_663436
Residue:
910
  
Inhibitor
Name:
BDBM50326991
Synonyms:
3-((E)-4-((3,4-dimethoxyphenethyl)(methyl)amino)but-2-enyl)-7,8-dimethoxy-1H-benzo[d]azepin-2(3H)-one | CHEMBL1253993
Type:
Small organic molecule
Emp. Form.:
C27H34N2O5
Mol. Mass.:
466.5693
SMILES:
COc1ccc(CCN(C)C\C=C\CN2C=Cc3cc(OC)c(OC)cc3CC2=O)cc1OC
: