Target
1,3-beta-D-glucan synthase catalytic subunit
Ligand
BDBM50327024
Substrate
Meas. Tech.
ChEMBL_663643 (CHEMBL1251396)
IC50
>48000±n/a nM
Citation
 Ma, CMAbe, TKomiyama, TWang, WHattori, MDaneshtalab, M Synthesis, anti-fungal and 1,3-ß-D-glucan synthase inhibitory activities of caffeic and quinic acid derivatives. Bioorg Med Chem 18:7009-14 (2010)  
Target
Name:
1,3-beta-D-glucan synthase catalytic subunit
Synonyms:
1,3-beta-D-glucan synthase catalytic subunit | Beta-1,3-glucan synthase
Type:
PROTEIN
Mol. Mass.:
80469.77
Organism:
Candida albicans
Description:
ChEMBL_663643
Residue:
690
  
Inhibitor
Name:
BDBM50327024
Synonyms:
3-((1S,3R,4R,5R)-3-((E)-3-(3,4-dihydroxyphenyl)acryloyloxy)-1,4,5-trihydroxycyclohexanecarboxamido)-4-(4-(octyloxy)phenylamino)-4-oxobutanoic acid CHEMBL412243
Type:
Small organic molecule
Emp. Form.:
C34H44N2O12
Mol. Mass.:
672.7194
SMILES:
CCCCCCCCOc1ccc(NC(=O)C(CC(O)=O)NC(=O)[C@]2(O)C[C@@H](O)[C@@H](O)[C@@H](C2)OC(=O)\C=C\c2ccc(O)c(O)c2)cc1
: