Target
1,3-beta-D-glucan synthase catalytic subunit
Ligand
BDBM50327027
Substrate
Meas. Tech.
ChEMBL_663643 (CHEMBL1251396)
IC50
>65000±n/a nM
Citation
 Ma, CMAbe, TKomiyama, TWang, WHattori, MDaneshtalab, M Synthesis, anti-fungal and 1,3-ß-D-glucan synthase inhibitory activities of caffeic and quinic acid derivatives. Bioorg Med Chem 18:7009-14 (2010)  
Target
Name:
1,3-beta-D-glucan synthase catalytic subunit
Synonyms:
1,3-beta-D-glucan synthase catalytic subunit | Beta-1,3-glucan synthase
Type:
PROTEIN
Mol. Mass.:
80469.77
Organism:
Candida albicans
Description:
ChEMBL_663643
Residue:
690
  
Inhibitor
Name:
BDBM50327027
Synonyms:
(1S,3R,4S,5R)-1,3,4,5-tetrahydroxy-N-(3-hydroxy-1-(4-(octyloxy)phenylamino)-1-oxobutan-2-yl)cyclohexanecarboxamide | CHEMBL1254665
Type:
Small organic molecule
Emp. Form.:
C25H40N2O8
Mol. Mass.:
496.5937
SMILES:
CCCCCCCCOc1ccc(NC(=O)C(NC(=O)[C@@]2(O)C[C@@H](O)[C@H](O)[C@H](O)C2)C(C)O)cc1
: