Target
Adenosine receptor A1
Ligand
BDBM50327330
Substrate
Meas. Tech.
ChEMBL_664373 (CHEMBL1259522)
IC50
233±n/a nM
Citation
 Griebenow, NBärfacker, LMeier, HSchneider, DTeusch, NLustig, KKast, RKolkhof, P Identification and optimization of substituted 5-aminopyrazoles as potent and selective adenosine A1 receptor antagonists. Bioorg Med Chem Lett 20:5891-4 (2010)  
Target
Name:
Adenosine receptor A1
Synonyms:
A1 adenosine receptor (hA1) AA1R_HUMAN ADORA1 Adenosine A1-receptor Adenosine receptor A1 (hA1) | Adenosine transporter (AdT)
Type:
G Protein-Coupled Receptor (GPCR)
Mol. Mass.:
36520.92
Organism:
Homo sapiens (Human)
Description:
P30542
Residue:
326
  
Inhibitor
Name:
BDBM50327330
Synonyms:
2-(4-(3,4-dimethoxyphenyl)-3-methyl-1-o-tolyl-1H-pyrazol-5-ylamino)-5-methoxybenzoic acid | CHEMBL1258052
Type:
Small organic molecule
Emp. Form.:
C27H27N3O5
Mol. Mass.:
473.5204
SMILES:
COc1ccc(Nc2c(c(C)nn2-c2ccccc2C)-c2ccc(OC)c(OC)c2)c(c1)C(O)=O
: