Target
Telomerase reverse transcriptase
Ligand
BDBM50327438
Substrate
Meas. Tech.
ChEMBL_664564 (CHEMBL1260105)
IC50
29100±n/a nM
Citation
 Liu, XHLiu, HFChen, JYang, YSong, BABai, LSLiu, JXZhu, HLQi, XB Synthesis and molecular docking study of novel coumarin derivatives containing 4,5-dihydropyrazole moiety as potential antitumor agents. Bioorg Med Chem Lett 20:5705-8 (2010)  
Target
Name:
Telomerase reverse transcriptase
Synonyms:
EST2 TERT TRT
Type:
PROTEIN
Mol. Mass.:
127099.03
Organism:
Homo sapiens (Human)
Description:
ChEMBL_1447029
Residue:
1132
  
Inhibitor
Name:
BDBM50327438
Synonyms:
3-(1-acetyl-5-(4-hydroxyphenyl)-4,5-dihydro-1H-pyrazol-3-yl)-2H-chromen-2-one | CHEMBL1258748
Type:
Small organic molecule
Emp. Form.:
C20H16N2O4
Mol. Mass.:
348.352
SMILES:
CC(=O)N1N=C(CC1c1ccc(O)cc1)c1cc2ccccc2oc1=O
: