Target
Transient receptor potential cation channel subfamily A member 1
Ligand
BDBM50327667
Substrate
Meas. Tech.
ChEMBL_664766 (CHEMBL1259376)
EC50
24±n/a nM
Citation
 Gijsen, HJBerthelot, DZaja, MBrône, BGeuens, IMercken, M Analogues of morphanthridine and the tear gas dibenz[b,f][1,4]oxazepine (CR) as extremely potent activators of the human transient receptor potential ankyrin 1 (TRPA1) channel. J Med Chem 53:7011-20 (2010)  
Target
Name:
Transient receptor potential cation channel subfamily A member 1
Synonyms:
ANKTM1 TRPA1 Transformation-sensitive protein p120 | Transient receptor potential cation channel subfamily A member 1 (TRPA1)
Type:
Protein
Mol. Mass.:
127514.20
Organism:
Homo sapiens (Human)
Description:
O75762
Residue:
1119
  
Inhibitor
Name:
BDBM50327667
Synonyms:
CHEMBL1084637 methyl dibenzo[b,f][1,4]oxazepine-4-carboxylate
Type:
Small organic molecule
Emp. Form.:
C15H11NO3
Mol. Mass.:
253.2527
SMILES:
COC(=O)c1cccc2C=Nc3ccccc3Oc12
: