Target
Transient receptor potential cation channel subfamily A member 1
Ligand
BDBM50327656
Substrate
Meas. Tech.
ChEMBL_664761 (CHEMBL1259371)
EC50
2.1±n/a nM
Citation
 Gijsen, HJBerthelot, DZaja, MBrône, BGeuens, IMercken, M Analogues of morphanthridine and the tear gas dibenz[b,f][1,4]oxazepine (CR) as extremely potent activators of the human transient receptor potential ankyrin 1 (TRPA1) channel. J Med Chem 53:7011-20 (2010)  
Target
Name:
Transient receptor potential cation channel subfamily A member 1
Synonyms:
ANKTM1 TRPA1 Transformation-sensitive protein p120 | Transient receptor potential cation channel subfamily A member 1 (TRPA1)
Type:
Protein
Mol. Mass.:
127514.20
Organism:
Homo sapiens (Human)
Description:
O75762
Residue:
1119
  
Inhibitor
Name:
BDBM50327656
Synonyms:
CHEMBL1256339 | Dibenzo[b,f][1,4]oxazepin-3-o
Type:
Small organic molecule
Emp. Form.:
C13H9NO2
Mol. Mass.:
211.2161
SMILES:
Oc1ccc2C=Nc3ccccc3Oc2c1
: