Target
Metabotropic glutamate receptor 5
Ligand
BDBM50327688
Substrate
Meas. Tech.
ChEMBL_664790 (CHEMBL1259400)
IC50
28±n/a nM
Citation
 Burdi, DFHunt, RFan, LHu, TWang, JGuo, ZHuang, ZWu, CHardy, LDetheux, MOrsini, MAQuinton, MSLew, RSpear, K Design, synthesis, and structure-activity relationships of novel bicyclic azole-amines as negative allosteric modulators of metabotropic glutamate receptor 5. J Med Chem 53:7107-18 (2010)  
Target
Name:
Metabotropic glutamate receptor 5
Synonyms:
GPRC1E GRM5_HUMAN metabotropic glutamate 5 | metabotropic glutamate 5a
Type:
Enzyme
Mol. Mass.:
132484.72
Organism:
Homo sapiens (Human)
Description:
Residue:
1212
  
Inhibitor
Name:
BDBM50327688
Synonyms:
3-Fluoro-5-(2-(pyridin-2-yl)-6,7-dihydrooxazolo[4,5-c]pyridin-5(4H)-yl)benzonitrile | CHEMBL1257273
Type:
Small organic molecule
Emp. Form.:
C18H13FN4O
Mol. Mass.:
320.3204
SMILES:
Fc1cc(cc(c1)N1CCc2oc(nc2C1)-c1ccccn1)C#N
: