Target
Bifunctional epoxide hydrolase 2
Ligand
BDBM50327823
Substrate
Meas. Tech.
ChEMBL_664906 (CHEMBL1259738)
IC50
3.5±n/a nM
Citation
 Rose, TEMorisseau, CLiu, JYInceoglu, BJones, PDSanborn, JRHammock, BD 1-Aryl-3-(1-acylpiperidin-4-yl)urea inhibitors of human and murine soluble epoxide hydrolase: structure-activity relationships, pharmacokinetics, and reduction of inflammatory pain. J Med Chem 53:7067-75 (2010)  
Target
Name:
Bifunctional epoxide hydrolase 2
Synonyms:
Eph2 Epoxide hydratase Soluble epoxide hydrolase (sEH)
Type:
Enzyme
Mol. Mass.:
62512.06
Organism:
Mus musculus (Mouse)
Description:
P34914
Residue:
554
  
Inhibitor
Name:
BDBM50327823
Synonyms:
1-Cyclohexyl-3-(1-propionylpiperidin-4-yl)urea US9296693, 4
Type:
Small organic molecule
Emp. Form.:
C15H27N3O2
Mol. Mass.:
281.3938
SMILES:
CCC(=O)N1CCC(CC1)NC(=O)NC1CCCCC1
: