Target
Serine/threonine-protein kinase mTOR
Ligand
BDBM50327904
Substrate
Meas. Tech.
ChEMBL_665023 (CHEMBL1260133)
Ki
0.8±n/a nM
Citation
 Liu, KKBagrodia, SBailey, SCheng, HChen, HGao, LGreasley, SHoffman, JEHu, QJohnson, TOKnighton, DLiu, ZMarx, MANambu, MDNinkovic, SPascual, BRafidi, KRodgers, CMSmith, GLSun, SWang, HYang, AYuan, JZou, A 4-methylpteridinones as orally active and selective PI3K/mTOR dual inhibitors. Bioorg Med Chem Lett 20:6096-9 (2010)  
Target
Name:
Serine/threonine-protein kinase mTOR
Synonyms:
FK506-binding protein 12-rapamycin complex-associated protein 1 FRAP FRAP1 MTOR Mammalian Target of Rapamycin (mTOR) RAFT1 Rapamycin and FKBP12 target 1 Serine/threonine-protein kinase (mTOR) | mTORC2
Type:
Rapamycin target protein
Mol. Mass.:
288917.12
Organism:
Homo sapiens (Human)
Description:
P42345
Residue:
2549
  
Inhibitor
Name:
BDBM50327904
Synonyms:
2-amino-4-methyl-6-(1H-pyrazol-3-yl)-8-(tetrahydro-2H-pyran-4-yl)pteridin-7(8H)-one | CHEMBL1258911
Type:
Small organic molecule
Emp. Form.:
C15H17N7O2
Mol. Mass.:
327.3412
SMILES:
Cc1nc(N)nc2n(C3CCOCC3)c(=O)c(nc12)-c1cc[nH]n1
: