Target
cAMP-specific 3',5'-cyclic phosphodiesterase 4B
Ligand
BDBM50328100
Substrate
Meas. Tech.
ChEMBL_665324 (CHEMBL1261001)
IC50
11±n/a nM
Citation
 Taltavull, JSerrat, JGràcia, JGavaldà, AAndrés, MCórdoba, MMiralpeix, MVilella, DBeleta, JRyder, HPagès, L Synthesis and biological activity of pyrido[3',2':4,5]thieno[3,2-d]pyrimidines as phosphodiesterase type 4 inhibitors. J Med Chem 53:6912-22 (2010)  
Target
Name:
cAMP-specific 3',5'-cyclic phosphodiesterase 4B
Synonyms:
3',5'-cyclic phosphodiesterase Isoform PDE4B1 PDE4B PDE4B_HUMAN Phosphodiesterase 4B (PDE4B) Phosphodiesterase Type 4 (PDE4B)
Type:
Protein
Mol. Mass.:
83318.87
Organism:
Homo sapiens (Human)
Description:
Q07343
Residue:
736
  
Inhibitor
Name:
BDBM50328100
Synonyms:
2,2-Dimethyl-5-morpholin-4-yl-N-(pyridin-4-ylmethyl)-1,2,3,4-tetrahydropyrimido[4',5':4,5]thieno[2,3-c]isoquinolin-8-amine | CHEMBL1257654
Type:
Small organic molecule
Emp. Form.:
C25H28N6OS
Mol. Mass.:
460.594
SMILES:
CC1(C)CCc2c(C1)c1c(nc2N2CCOCC2)sc2c(NCc3ccncc3)ncnc12
: