Target
Breakpoint cluster region protein/Tyrosine-protein kinase ABL1
Ligand
BDBM50328182
Substrate
Meas. Tech.
ChEMBL_665342 (CHEMBL1261019)
EC50
>10000±n/a nM
Citation
 Deng, XOkram, BDing, QZhang, JChoi, YAdrián, FJWojciechowski, AZhang, GChe, JBursulaya, BCowan-Jacob, SWRummel, GSim, TGray, NS Expanding the diversity of allosteric bcr-abl inhibitors. J Med Chem 53:6934-46 (2010)  
Target
Name:
Breakpoint cluster region protein/Tyrosine-protein kinase ABL1
Synonyms:
Bcr-Abl Breakpoint cluster region protein /Tyrosine-protein kinase ABL | Tyrosine-protein kinase ABL1/Breakpoint cluster region protein
Type:
Enzyme
Mol. Mass.:
Description:
Components:
This complex has 2 components.
Component 1
Name:
Tyrosine-protein kinase ABL1
Synonyms:
ABL ABL1_HUMAN JTK7 Proto-oncogene tyrosine-protein kinase ABL1 Tyrosine-protein kinase ABL V-abl Abelson murine leukemia viral oncogene homolog 1 p150 | tyrosine-protein kinase ABL1 isoform a
Type:
Enzyme
Mol. Mass.:
122897.30
Organism:
Homo sapiens (Human)
Description:
P00519
Residue:
1130
  
Component 2
Name:
Breakpoint cluster region protein
Synonyms:
BCR BCR_HUMAN Breakpoint cluster region protein | D22S11
Type:
PROTEIN
Mol. Mass.:
142824.75
Organism:
Homo sapiens (Human)
Description:
ChEMBL_305348
Residue:
1271
  
Inhibitor
Name:
BDBM50328182
Synonyms:
CHEMBL1257193 | N2-(2-morpholinoethyl)-N4-(4-(trifluoromethoxy)phenyl)-1,3,5-triazine-2,4-diamine
Type:
Small organic molecule
Emp. Form.:
C16H19F3N6O2
Mol. Mass.:
384.3563
SMILES:
FC(F)(F)Oc1ccc(Nc2ncnc(NCCN3CCOCC3)n2)cc1
: